Page 1 of 1

rpmbuild glibc-2.3.4-2.19

Posted: 2006/04/06 10:37:12
by roballoway
When trying to recompile glibc-2.3.4-2.19 with rpmbuild I get the following error:

make -s -C nscd others
make[2]: Entering directory `/usr/src/redhat/BUILD/glibc-2.3.6/nscd'
make[2]: Leaving directory `/usr/src/redhat/BUILD/glibc-2.3.6/nscd'
make[2]: Entering directory `/usr/src/redhat/BUILD/glibc-2.3.6/nscd'
pwdcache.c: In function `cache_addpw':
pwdcache.c:117: warning: implicit declaration of function `send'
pwdcache.c:117: error: `MSG_NOSIGNAL' undeclared (first use in this function)
pwdcache.c:117: error: (Each undeclared identifier is reported only once
pwdcache.c:117: error: for each function it appears in.)
make[2]: *** [/usr/src/redhat/BUILD/glibc-2.3.6/build-i386-linux/nscd/pwdcache.o
] Error 1
make[2]: *** Waiting for unfinished jobs....
make[2]: Leaving directory `/usr/src/redhat/BUILD/glibc-2.3.6/nscd'
make[1]: *** [nscd/others] Error 2
make[1]: Leaving directory `/usr/src/redhat/BUILD/glibc-2.3.6'
make: *** [all] Error 2
error: Bad exit status from /var/tmp/rpm-tmp.56765 (%build)


RPM build errors:
Bad exit status from /var/tmp/rpm-tmp.56765 (%build)

rpmbuild glibc-2.3.4-2.19

Posted: 2006/07/03 19:34:46
by z00dax
what architecture / version of centos are you building on ? is this an everything install ? are you doing this inside a chroot ?